Differentiation
type: ConceptualFrame
type: NamedIndividual
type: Frame
type: Class
comment: Words in this frame have to do with a Cognizer being aware (or not being aware) of the difference between two Phenomena, which may be expressed jointly or disjointly. It is very difficult for people to visually distinguish between living and non-living things from such a great distance .
subclass of: FrameOccurrence
narrower match: synset-distinguishable-adjective-1
frame sectivity: sub
definition: Words in this frame have to do with a Cognizer being aware (or not being aware) of the difference between two Phenomena, which may be expressed jointly or disjointly. It is very difficult for people to visually distinguish between living and non-living things from such a great distance .
definition: <def-root>Words in this frame have to do with a <fen>Cognizer</fen> being aware (or not being aware) of the difference between two <fen>Phenomena</fen>, which may be expressed jointly or disjointly. <ex>It is very difficult for <fex name="Cognizer">people</fex> to <fex name="Means">visually</fex> <t>distinguish</t> <fex name="Phenomena">between living and non-living things</fex> <fex name="Circumstances">from such a great distance</fex> .</ex> </def-root>
frame ID: 24
frame c by: ChW
frame c date: 2001-02-07T13:11:54+01:00
frame name: Differentiation
has f ecore set: differentiation coreSet1
has frame element: Phenomena.differentiation
has frame element: Cognizer.differentiation
has frame element: Quality.differentiation
has frame element: Degree.differentiation
has frame element: Depictive.differentiation
has frame element: Manner.differentiation
has frame element: Phenomenon 2.differentiation
has frame element: Means.differentiation
has frame element: Phenomenon 1.differentiation
has frame element: Circumstances.differentiation
has frame relation: Mental activity
has lex unit: separate.v
has lex unit: discriminate.v
has lex unit: discrimination.n
has lex unit: distinguishable.a
has lex unit: differentiate.v
has lex unit: distinguishable.adj
has lex unit: tell apart.v
has lex unit: tell from.v
has lex unit: sort.v
has lex unit: distinguish.v
has lex unit: know.v
uses: Mental activity