Differentiation
definition: Words in this frame have to do with a Cognizer being aware (or not being aware) of the difference between two Phenomena, which may be expressed jointly or disjointly. It is very difficult for people to visually distinguish between living and non-living things from such a great distance .
has lex unit: separate.v
frame ID: 24
has lex unit: discriminate.v
has frame element: Phenomena.differentiation
type: ConceptualFrame
has lex unit: discrimination.n
type: NamedIndividual
has frame element: Cognizer.differentiation
definition: <def-root>Words in this frame have to do with a <fen>Cognizer</fen> being aware (or not being aware) of the difference between two <fen>Phenomena</fen>, which may be expressed jointly or disjointly. <ex>It is very difficult for <fex name="Cognizer">people</fex> to <fex name="Means">visually</fex> <t>distinguish</t> <fex name="Phenomena">between living and non-living things</fex> <fex name="Circumstances">from such a great distance</fex> .</ex> </def-root>
frame name: Differentiation
has lex unit: distinguishable.a
has frame element: Quality.differentiation
narrower match: synset-distinguishable-adjective-1
comment: Words in this frame have to do with a Cognizer being aware (or not being aware) of the difference between two Phenomena, which may be expressed jointly or disjointly. It is very difficult for people to visually distinguish between living and non-living things from such a great distance .
has lex unit: differentiate.v
has frame element: Degree.differentiation
has frame element: Depictive.differentiation
has f ecore set: differentiation coreSet1
has lex unit: distinguishable.adj
has lex unit: tell apart.v
subclass of: FrameOccurrence
frame c by: ChW
has frame element: Manner.differentiation
has lex unit: tell from.v
frame sectivity: sub
has frame element: Phenomenon 2.differentiation
type: Frame
has lex unit: sort.v
has lex unit: distinguish.v
frame c date: 2001-02-07T13:11:54+01:00
has frame element: Means.differentiation
has frame element: Phenomenon 1.differentiation
uses: Mental activity
has lex unit: know.v
has frame element: Circumstances.differentiation
has frame relation: Mental activity
type: Class