Cure
has lex unit: remedy.v
see also: Medical intervention
has lex unit: therapeutic.adj
has lex unit: incurable.adj
has lex unit: curative.n
subclass of: Restriction
  on property: hasComponent
  some values from: Medical specialties
narrower match: synset-curable-adjective-1
has lex unit: therapy.n
comment: This frame deals with a Healer treating and curing an Affliction (the injuries, disease, or pain) of the Patient, sometimes also mentioning the use of a particular Treatment or Medication. This frame differs from Medical_intervention in that this frame deals only with cases in which the Patient is cured of the Affliction, not just treated for the Affliction. Isis then cured Re by reciting a spell. Another student became convinced that God was going to heal the clergyman of his cancer.
has frame element: Reciprocation.cure
frame c by: ChW
frame ID: 50
type: Frame
inherits from: Objective influence
has f ecore set: cure coreSet2
has frame relation: Medical intervention
has lex unit: rehabilitative.adj
is used by: Medical interaction scenario
inherits from: Transitive action
has frame element: Manner.cure
is causative of: Recovery
has frame relation: Medical interaction scenario
is used by: Medical professionals
has frame element: Place.cure
uses: Medical conditions
has frame element: Medication.cure
has lex unit: therapist.n
has lex unit: treat.v
has frame relation: Medical conditions
narrower match: synset-rehabilitative-adjective-1
has lex unit: cure.v
is used by: Medical specialties
has frame element: Degree.cure
has frame relation: Recovery
frame c date: 2001-02-07T13:12:08+01:00
has frame element: Motivation.cure
has lex unit: curable.adj
has lex unit: curative.adj
has frame element: Purpose.cure
frame sectivity: inter
has lex unit: cure.n
has frame element: Time.cure
has lex unit: heal.v
has lex unit: nurse.v
has lex unit: incurable.a
definition: <def-root>This frame deals with a <fen>Healer</fen> treating and curing an <fen>Affliction</fen> (the injuries, disease, or pain) of the <fen>Patient</fen>, sometimes also mentioning the use of a particular <fen>Treatment</fen> or <fen>Medication</fen>. </def-root>
has frame relation: Institutionalization
has lex unit: curative.a
has lex unit: palliation.n
has lex unit: rehabilitation.n
has frame element: Treatment.cure
has lex unit: alleviate.v
definition: This frame deals with a Healer treating and curing an Affliction (the injuries, disease, or pain) of the Patient, sometimes also mentioning the use of a particular Treatment or Medication.
is used by: Medical instruments
narrower match: synset-alleviative-adjectivesatellite-1
has lex unit: remedy.n
has lex unit: alleviation.n
has f ecore set: cure coreSet1
frame name: Cure
has lex unit: palliative.n
has frame element: Patient.cure
is used by: Institutionalization
has lex unit: palliate.v
has frame element: Healer.cure
has frame element: Duration.cure
subclass of: Transitive action
has frame element: Body part.cure
has lex unit: ease.v
has lex unit: rehabilitate.v
type: Class
has frame relation: Transitive action
has lex unit: palliative.adj
has lex unit: healer.n
has lex unit: resuscitate.v
has lex unit: therapeutic.a
has frame element: Affliction.cure
has lex unit: treatment.n
has lex unit: palliative.a
narrower match: synset-incurable-adjective-1
has lex unit: curable.a