Creating
has lex unit: yield.v
has frame element: Circumstances.creating
has frame element: Instrument.creating
frame name: Creating
inherits from: Transitive action
type: Frame
has lex unit: create.v
has lex unit: generate.v
has frame element: Depictive.creating
frame c date: 2002-05-10T21:28:39+02:00
inherits from: Objective influence
has frame element: Recipient.creating
has frame element: Role.creating
has frame element: Co-participant.creating
frame c by: MJE
has lex unit: production.n
has frame relation: Intentionally create
has frame element: Cause.creating
has lex unit: form.v
has frame element: Co participant.creating
has frame element: Beneficiary.creating
has frame element: Period of iterations.creating
has frame element: Time.creating
has lex unit: assemble.v
is used by: Ingredients
has frame element: Creator.creating
has lex unit: issuance.n
has frame element: Place.creating
definition: A Cause leads to the formation of a Created_entity. Dr. Frankenstein created a monster.
has frame element: Purpose.creating
has frame element: Components.creating
has lex unit: issue.v
subclass of: Transitive action
has frame element: Imposed purpose.creating
has lex unit: make.v
type: Class
has lex unit: produce.v
has frame element: Created entity.creating
comment: A Cause leads to the formation of a Created_entity. Dr. Frankenstein created a monster.
frame ID: 319
has frame relation: Ingredients
has frame element: Purpose of created entity.creating
is inherited by: Intentionally create
definition: <def-root>A <fen>Cause</fen> leads to the formation of a <fen>Created_entity</fen>.</def-root>
has frame element: Frequency.creating
has frame element: Manner.creating
has frame relation: Transitive action
has lex unit: formation.n
definition: A Cause leads to the formation of a Created_entity.
subclass of: Restriction
  on property: hasComponent
  some values from: Ingredients
inherits from: Event
subclass of: Restriction
  on property: hasComponent
  some values from: Intentionally create
has frame element: Means.creating