Containing
has frame element: Time.containing
has frame relation: Fullness
inherits from: Locative relation
type: Frame
type: Class
perspective on: Containment
inherits from: State
has frame relation: Locative relation
has lex unit: contain.v
activates: CONTAINMENT
frame ID: 397
frame name: Containing
type: NamedIndividual
inherits from: Relation
has frame element: Container.containing
has frame element: Contents.containing
perspective on: Containment scenario
definition: In this frame a Container holds within its physical boundaries the Contents. The box holds three hundred pictures.
frame c date: 2002-08-15T15:28:37+02:00
inherits from: Trajector-Landmark
subclass of: Restriction
  on property: hasComponent
  some values from: Fullness
has lex unit: hold.v
definition: <def-root>In this frame a <fen>Container</fen> holds within its physical boundaries the <fen>Contents</fen>. <ex><fex name="Container">The box</fex> <t>holds</t> <fex name="Contents">three hundred pictures</fex>.</ex></def-root>
has frame relation: Containment scenario
subclass of: Locative relation
comment: In this frame a Container holds within its physical boundaries the Contents. The box holds three hundred pictures.
is used by: Fullness
frame c by: MRLP
has frame relation: Containers
subclass of: Restriction
  on property: hasComponent
  some values from: Containers
has lex unit: store.v
has lex unit: house.v
is used by: Containers