Containers
type: Class
type: Frame
type: NamedIndividual
activates: CONTAINMENT
comment: This frame covers entities which are prototypically conceived of and created to fulfill the function of containing--i.e. Containers that contain objects or substances, the Contents. This can be expressed as a complement , and includes potential or intended contents. A Container may also have an Owner, a current Relative_location, Material from which it is constructed, a method of Construction, and a Type. Note the connection between words in this frame and those in the Filling, Emptying, and Fullness frames. a bag of popcorn underwear drawer Chuck's suitcase the suitcase in Chuck's office straw basket woven basket Erlenmeyer flask
subclass of: Thing
definition: This frame covers entities which are prototypically conceived of and created to fulfill the function of containing--i.e. Containers that contain objects or substances, the Contents. This can be expressed as a complement , and includes potential or intended contents. A Container may also have an Owner, a current Relative_location, Material from which it is constructed, a method of Construction, and a Type. Note the connection between words in this frame and those in the Filling, Emptying, and Fullness frames. a bag of popcorn underwear drawer Chuck's suitcase the suitcase in Chuck's office straw basket woven basket Erlenmeyer flask
frame ID: 78
frame c by: ChW
frame c date: 2001-02-07T13:12:27+01:00
frame name: Containers
has frame element: Descriptor.containers
has frame element: Material.containers
has frame element: Container.containers
has frame element: Contents.containers
has frame element: Construction.containers
has frame element: Use.containers
has frame element: Part.containers
has frame element: Relative location.containers
has frame element: Type.containers
has frame element: Owner.containers
has frame relation: Containing
has frame relation: Bounded entity
has lex unit: goblet.n
has lex unit: teaspoon.n
has lex unit: cylinder.n
has lex unit: barrel.n
has lex unit: cart.n
has lex unit: canteen.n
has lex unit: urn.n
has lex unit: chalice.n
has lex unit: thermos.n
has lex unit: handbag.n
has lex unit: tank.n
has lex unit: drawer.n
has lex unit: crate.n
has lex unit: canister.n
has lex unit: case.n
has lex unit: pot cooking.n
has lex unit: coffin.n
has lex unit: amphora.n
has lex unit: capsule.n
has lex unit: flagon.n
has lex unit: casket.n
has lex unit: basin.n
has lex unit: safe.n
has lex unit: cartridge.n
has lex unit: spoon.n
has lex unit: empty.n
has lex unit: cooler.n
has lex unit: vial.n
has lex unit: snifter.n
has lex unit: jug.n
has lex unit: planter.n
has lex unit: sack.n
has lex unit: tun.n
has lex unit: bottle hot-water.n
has lex unit: bin.n
has lex unit: magnum.n
has lex unit: crock.n
has lex unit: bottle wine.n
has lex unit: chest.n
has lex unit: ampule.n
has lex unit: pack.n
has lex unit: overnighter.n
has lex unit: envelope.n
has lex unit: bag.n
has lex unit: container.n
has lex unit: cruet.n
has lex unit: bowl toilet.n
has lex unit: vivarium.n
has lex unit: box.n
has lex unit: folder.n
has lex unit: satchel.n
has lex unit: tureen.n
has lex unit: beaker.n
has lex unit: spittoon.n
has lex unit: etui.n
has lex unit: carton.n