Connectors
comment: The Connector is an artifact created to affix a Connected_item or to bind onto a Fixed_location and is primarily so used. A more specific Use may also be specified. Certain words in this frame (e.g. bond, chain in the phrase in chains) indicate specifically that the Connector is being used to immobilize something. Connectors have a wide variety of physical forms: long, thin, and flexible for tying (ropes, bonds, withies); solid, with a shape corresponding to holes in the entities to be connected (bolts, nails, pegs); and liquid (glues, adhesives, pastes). A waterproof adhesive should be used for this exterior job. His bonds had to be loosened before they could be cut. She jerked on His neck rope again, to keep his attention. I think they cut his bike chain with bolt cutters.
has lex unit: tape.n
inherits from: Artifact
has lex unit: tack.n
has frame element: Fixed location.connectors
frame c by: MJE
inherits from: Entity
has lex unit: bond.n
definition: The Connector is an artifact created to affix a Connected_item or to bind onto a Fixed_location and is primarily so used. A more specific Use may also be specified. Certain words in this frame (e.g. <ment>bond, chain</ment> in the phrase <ment>in chains</ment>) indicate specifically that the Connector is being used to immobilize something. Connectors have a wide variety of physical forms: long, thin, and flexible for tying (<ment>ropes, bonds, withies</ment>); solid, with a shape corresponding to holes in the entities to be connected (<ment>bolts, nails, pegs</ment>); and liquid (<ment>glues, adhesives, pastes</ment>). A waterproof adhesive should be used for this exterior job. <x>His bonds</x> had to be <gov>loosened</gov> before they could be cut. She <gov>jerked</gov> <x>on His neck rope</x> again, to keep his attention. I think they <gov>cut</gov> <x>his bike chain</x> with bolt cutters.
has lex unit: adhesive.n
has frame element: Type.connectors
frame name: Connectors
has lex unit: peg.n
has frame relation: Artifact
has frame element: Creator.connectors
type: Class
has lex unit: nut.n
has lex unit: trace.n
has lex unit: string.n
has lex unit: bolt.n
has lex unit: rope.n
has sem type: Artifact
type: Frame
has lex unit: connector.n
definition: The Connector is an artifact created to affix a Connected_item or to bind onto a Fixed_location and is primarily so used. A more specific Use may also be specified. Certain words in this frame (e.g. bond, chain in the phrase in chains) indicate specifically that the Connector is being used to immobilize something. Connectors have a wide variety of physical forms: long, thin, and flexible for tying (ropes, bonds, withies); solid, with a shape corresponding to holes in the entities to be connected (bolts, nails, pegs); and liquid (glues, adhesives, pastes). A waterproof adhesive should be used for this exterior job. His bonds had to be loosened before they could be cut. She jerked on His neck rope again, to keep his attention. I think they cut his bike chain with bolt cutters.
has lex unit: tie.n
has lex unit: wire.n
uses: Attaching
has frame element: Connector.connectors
has lex unit: screw.n
subclass of: Artifact
has lex unit: shoelace.n
has frame element: Time of creation.connectors
frame c date: 2002-10-25T10:28:49+02:00
has lex unit: link.n
has lex unit: chain.n
has frame element: Name.connectors
has frame relation: Attaching
has lex unit: nail.n
has lex unit: cord.n
frame ID: 419
has lex unit: glue.n
has frame element: Material.connectors
has lex unit: ribbon.n
has lex unit: lace.n
has lex unit: thread.n
definition: <def-root>The <fen>Connector</fen> is an artifact created to affix a <fen>Connected_item</fen> or to bind onto a <fen>Fixed_location</fen> and is primarily so used. A more specific <fen>Use</fen> may also be specified. Certain words in this frame (e.g. <ment>bond, chain</ment> in the phrase <ment>in chains</ment>) indicate specifically that the <fen>Connector</fen> is being used to immobilize something. <fen>Connector</fen>s have a wide variety of physical forms: long, thin, and flexible for tying (<ment>ropes, bonds, withies</ment>); solid, with a shape corresponding to holes in the entities to be connected (<ment>bolts, nails, pegs</ment>); and liquid (<ment>glues, adhesives, pastes</ment>). <ex>A waterproof <fex name="Connector"><t>adhesive</t></fex> should be used for this exterior job.</ex> <ex><x><fex name="Item">His</fex> <t><fex name="Connector">bonds</fex></t></x> had to be <gov>loosened</gov> before they could be cut.</ex> <ex>She <gov>jerked</gov> <x>on <fex name="Connected_item">His</fex> <fex name="Loc">neck</fex> <fex name="Connector"><t>rope</t></fex></x> again, to keep his attention.</ex> <ex>I think they <gov>cut</gov> <x>his <fex name="Use">bike</fex> <fex name="Connector"><t>chain</t></fex></x> with bolt cutters.</ex></def-root>
has frame element: Connected item.connectors
has frame element: Descriptor.connectors
has lex unit: withy.n
has lex unit: staple.n
has lex unit: strap.n
has frame element: Use.connectors