Conduct
definition: An Agent acts in a certain Manner either generally or under some particular Circumstances. The conduct may also be directed specifically towards an Affected_party. He pledges to conduct himself with honesty and humility. This year they have behaved themselves particularly impudently. His appearance was as immaculate as ever and his bearing composed and dignified.
has frame relation: Social behavior evaluation
has lex unit: act up.v
has frame element: Circumstances.conduct
has lex unit: conduct.n
has frame element: Affected Party.conduct
comment: An Agent acts in a certain Manner either generally or under some particular Circumstances. The conduct may also be directed specifically towards an Affected_party. He pledges to conduct himself with honesty and humility. This year they have behaved themselves particularly impudently. His appearance was as immaculate as ever and his bearing composed and dignified.
has frame element: Domain.conduct
has lex unit: behavior.n
has lex unit: misbehavior.n
has frame element: Standard.conduct
has lex unit: comportment.n
has lex unit: conduct.v
type: Class
has frame relation: Intentionally act
has lex unit: behave.v
subclass of: Restriction
  on property: hasComponent
  some values from: Feigning
has frame relation: Treating and mistreating
uses: Intentionally act
is inherited by: Treating and mistreating
definition: An Agent acts in a certain Manner either generally or under some particular Circumstances. The conduct may also be directed specifically towards an Affected_Party. He pledges to conduct himself with honesty and humility. This year they have behaved themselves particularly impudently. His appearance was as immaculate as ever and his bearing composed and dignified.
has frame relation: Feigning
frame name: Conduct
has lex unit: manner.n
has lex unit: bearing.n
frame c date: 2003-01-14T14:37:28+01:00
has frame element: Time.conduct
has lex unit: deportment.n
has frame element: Means.conduct
type: Frame
frame ID: 491
has frame element: Affected party.conduct
has lex unit: demeanor.n
uses: Social behavior evaluation
is used by: Feigning
has lex unit: carry oneself.v
has lex unit: maturity.n
has frame element: Manner.conduct
has frame element: Degree.conduct
has lex unit: way.n
has frame element: Reason.conduct
frame c by: JKR
has frame element: Place.conduct
definition: <def-root>An <fen>Agent</fen> acts in a certain <fen>Manner</fen> either generally or under some particular <fen>Circumstances</fen>. The conduct may also be directed specifically towards an <fen>Affected_Party</fen>. <ex> <fex name="Agent">He</fex> pledges to <t>conduct</t> himself <fex name="Manner">with honesty and humility</fex>.</ex> <ex> This year <fex name="Agent">they</fex> have <t>behaved</t> themselves <fex name="Manner">particularly impudently</fex>.</ex> <ex> His appearance was as immaculate as ever and <fex name="Agent">his</fex> <t>bearing</t> <fex name="Manner">composed and dignified</fex>. </ex></def-root>
has lex unit: act.v
has lex unit: misbehave.v
has frame element: Explanation.conduct
has frame element: Agent.conduct