Commerce_scenario
has frame element: Rate.commerce scenario
has frame element: Manner.commerce scenario
type: Frame
subclass of: Restriction
  on property: hasComponent
  some values from: Commercial transaction
subclass of: Restriction
  on property: hasComponent
  some values from: Businesses
has frame relation: Having commercial agreement
has frame relation: Exchange currency
has frame relation: Businesses
subclass of: Restriction
  on property: hasComponent
  some values from: Commerce buy
type: Non-perspectivalized frame
has lex unit: vendor.n
has sem type: Non-perspectivalized frame
subclass of: Restriction
  on property: hasComponent
  some values from: Commerce collect
has lex unit: merchandise.n
has frame element: Buyer.commerce scenario
has frame relation: Expensiveness
has frame element: Goods.commerce scenario
has frame element: Seller.commerce scenario
frame ID: 82
definition: Commerce is a situation in which a Buyer and a Seller have agreed upon an exchange of Money and Goods (possibly after a negotiation), and then perform the exchange, optionally carrying it out with various kinds of direct payment or financing or the giving of change. The Seller indicates their willingness to give the Goods in their possession to a Buyer who would give them some amount of Money. The Seller may have already decided on the amount of money that they would require, in which case it is called the Asking price. The Buyer also indicates their willingness to give an amount of money called an Offer to a Seller who would give them the Goods. Normally the process is begun by the Seller. The means by which the Seller indicates their wish to engage in an exchange are various, ranging from putting a price tag on an item on a store shelf, to advertizing, to communicating directly and specifically with a possible Buyer. In some cases, however, the process may be initiated by the Buyer indicating to a possible Seller that they would like to make an exchange. buyer beware.
definition: <def-root>Commerce is a situation in which a <fen>Buyer</fen> and a <fen>Seller</fen> have agreed upon an exchange of <fen>Money</fen> and <fen>Goods</fen> (possibly after a negotiation), and then perform the exchange, optionally carrying it out with various kinds of direct payment or financing or the giving of change. <ex></ex> The <fen>Seller</fen> indicates their willingness to give the <fen>Goods</fen> in their possession to a <fen>Buyer</fen> who would give them some amount of <fen>Money</fen>. The <fen>Seller</fen> may have already decided on the amount of money that they would require, in which case it is called the Asking price. <ex></ex> The <fen>Buyer</fen> also indicates their willingness to give an amount of money called an Offer to a <fen>Seller</fen> who would give them the <fen>Goods</fen>. <ex></ex> Normally the process is begun by the <fen>Seller</fen>. The means by which the <fen>Seller</fen> indicates their wish to engage in an exchange are various, ranging from putting a price tag on an item on a store shelf, to advertizing, to communicating directly and specifically with a possible <fen>Buyer</fen>. In some cases, however, the process may be initiated by the <fen>Buyer</fen> indicating to a possible <fen>Seller</fen> that they would like to make an exchange.</def-root>
definition: Commerce is a situation in which a Buyer and a Seller have agreed upon an exchange of Money and Goods (possibly after a negotiation), and then perform the exchange, optionally carrying it out with various kinds of direct payment or financing or the giving of change. The Seller indicates their willingness to give the Goods in their possession to a Buyer who would give them some amount of Money. The Seller may have already decided on the amount of money that they would require, in which case it is called the Asking price. The Buyer also indicates their willingness to give an amount of money called an Offer to a Seller who would give them the Goods. Normally the process is begun by the Seller. The means by which the Seller indicates their wish to engage in an exchange are various, ranging from putting a price tag on an item on a store shelf, to advertizing, to communicating directly and specifically with a possible Buyer. In some cases, however, the process may be initiated by the Buyer indicating to a possible Seller that they would like to make an exchange.
has lex unit: goods.n
is used by: Exchange currency
is used by: Expensiveness
has lex unit: commerce.n
has lex unit: buyer.n
subclass of: Restriction
  on property: hasComponent
  some values from: Exchange currency
has subframe: Commercial transaction
has lex unit: purchaser.n
frame name: Commerce_scenario
has frame element: Means.commerce scenario
frame c date: 2001-02-07T13:12:28+01:00
has lex unit: price.n
type: Class
has frame element: Purpose.commerce scenario
comment: Commerce is a situation in which a Buyer and a Seller have agreed upon an exchange of Money and Goods (possibly after a negotiation), and then perform the exchange, optionally carrying it out with various kinds of direct payment or financing or the giving of change. The Seller indicates their willingness to give the Goods in their possession to a Buyer who would give them some amount of Money. The Seller may have already decided on the amount of money that they would require, in which case it is called the Asking price. The Buyer also indicates their willingness to give an amount of money called an Offer to a Seller who would give them the Goods. Normally the process is begun by the Seller. The means by which the Seller indicates their wish to engage in an exchange are various, ranging from putting a price tag on an item on a store shelf, to advertizing, to communicating directly and specifically with a possible Buyer. In some cases, however, the process may be initiated by the Buyer indicating to a possible Seller that they would like to make an exchange. buyer beware.
frame c by: ChW
is used by: Businesses
subclass of: Restriction
  on property: hasComponent
  some values from: Having commercial agreement
has frame element: Unit.commerce scenario
has lex unit: trafficker.n
has frame relation: Commercial transaction
subclass of: Restriction
  on property: hasComponent
  some values from: Expensiveness
has lex unit: supply side.n
has frame element: Money.commerce scenario
has lex unit: seller.n
subclass of: Restriction
  on property: hasComponent
  some values from: Commerce sell
has subframe: Having commercial agreement
has lex unit: retailer.n
subclass of: Restriction
  on property: hasComponent
  some values from: Commerce pay