Coming_up_with
type: Frame
type: Class
comment: Words in this frame have to do with a Cognizer creating a new intellectual entity, the Idea. These words are similar to words of physical creation such as build and make, and in some cases may be understood as metaphorically based on such words. However, the Ideas in this frame are predominantly conceptual in nature. Compare this frame with Achieving_first. In that frame, the fact that the idea is new to society is emphasized, whereas Coming_up_with refers to an agentive Cognizer using mental effort to figure something out, without any implication of the impact of the idea. I 've been trying to come up with a plan .
subclass of: Restriction
  on property: hasComponent
  some values from: Creating
subclass of: Restriction
  on property: hasComponent
  some values from: Achieving first
definition: Words in this frame have to do with a Cognizer creating a new intellectual entity, the Idea. These words are similar to words of physical creation such as build and make, and in some cases may be understood as metaphorically based on such words. However, the Ideas in this frame are predominantly conceptual in nature. Compare this frame with Achieving_first. In that frame, the fact that the idea is new to society is emphasized, whereas Coming_up_with refers to an agentive Cognizer using mental effort to figure something out, without any implication of the impact of the idea. I 've been trying to come up with a plan .
definition: Words in this frame have to do with a Cognizer creating a new intellectual entity, the Idea. These words are similar to words of physical creation such as <ment>build</ment> and <ment>make</ment>, and in some cases may be understood as metaphorically based on such words. However, the Ideas in this frame are predominantly conceptual in nature. Compare this frame with Achieving_first. In that frame, the fact that the idea is new to society is emphasized, whereas Coming_up_with refers to an agentive Cognizer using mental effort to figure something out, without any implication of the impact of the idea. I 've been trying to come up with a plan .
definition: <def-root>Words in this frame have to do with a <fen>Cognizer</fen> creating a new intellectual entity, the <fen>Idea</fen>. These words are similar to words of physical creation such as <ment>build</ment> and <ment>make</ment>, and in some cases may be understood as metaphorically based on such words. However, the <fen>Idea</fen>s in this frame are predominantly conceptual in nature. Compare this frame with Achieving_first. In that frame, the fact that the idea is new to society is emphasized, whereas Coming_up_with refers to an agentive <fen>Cognizer</fen> using mental effort to figure something out, without any implication of the impact of the idea. <ex><fex name="Cog">I</fex> 've been trying to <t>come up</t> <fex name="Idea">with a plan</fex> .</ex> </def-root>
frame ID: 27
frame c by: ChW
frame c date: 2001-02-07T13:11:56+01:00
frame name: Coming_up_with
has frame element: Place.coming up with
has frame element: Location of appearance.coming up with
has frame element: Purpose.coming up with
has frame element: Time.coming up with
has frame element: Material.coming up with
has frame element: Idea.coming up with
has frame element: Means.coming up with
has frame element: Result.coming up with
has frame element: Manner.coming up with
has frame element: Depictive.coming up with
has frame element: Amount of progress.coming up with
has frame element: Cognizer.coming up with
has frame relation: Eventive affecting
has lex unit: coin.v
has lex unit: formulate.v
has lex unit: find.v
has lex unit: up think.v
has lex unit: devise.v
has lex unit: invention artifact.n
has lex unit: concoction.n
has lex unit: design.n
has lex unit: design.v
has lex unit: concoct.v
has lex unit: invention process.n
has lex unit: improvise.v
has lex unit: invent.v
has lex unit: think up.v
has lex unit: come up.v
has lex unit: contrive.v
has lex unit: contrivance.n
has lex unit: up come.v
has lex unit: cook up.v
has lex unit: invention.n
has lex unit: conceive.v
has lex unit: hatch.v
uses: Eventive affecting