Cogitation
type: Class
type: Frame
comment: A person, the Cognizer, thinks about a Topic over a period of time. What is thought about may be a course of action that the person might take, or something more general. The men were silently mulling over the proposition of committing an assassination
subclass of: Restriction
  on property: hasComponent
  some values from: Research
subclass of: Restriction
  on property: hasComponent
  some values from: Remembering experience
subclass of: Restriction
  on property: hasComponent
  some values from: Memorization
subclass of: Restriction
  on property: hasComponent
  some values from: Emotion active
subclass of: Restriction
  on property: hasComponent
  some values from: Assessing
definition: A person, the Cognizer, thinks about a Topic over a period of time. What is thought about may be a course of action that the person might take, or something more general. The men were silently mulling over the proposition of committing an assassination
definition: <def-root>A person, the <fen>Cognizer</fen>, thinks about a <fen>Topic</fen> over a period of time. What is thought about may be a course of action that the person might take, or something more general. <ex><fex name="Cognizer">The men</fex> were <fex name="Manner">silently</fex> <t>mulling</t> <t>over</t> <fex name="Topic">the proposition of committing an assassination</fex></ex></def-root>
frame ID: 22
frame c by: ChW
frame c date: 2001-02-07T13:11:54+01:00
frame name: Cogitation
has frame element: Cognizer.cogitation
has frame element: Medium.cogitation
has frame element: Purpose.cogitation
has frame element: Topic.cogitation
has frame element: Degree.cogitation
has frame element: Means.cogitation
has frame element: Time.cogitation
has frame element: Depictive.cogitation
has frame element: Result.cogitation
has frame element: Manner.cogitation
has frame relation: Memorization
has frame relation: Mental activity
has frame relation: Emotion active
has frame relation: Research
has frame relation: Assessing
has frame relation: Remembering experience
has lex unit: thought.n
has lex unit: deliberation.n
has lex unit: give thought.v
has lex unit: deliberate.v
has lex unit: meditate.v
has lex unit: contemplation.n
has lex unit: wonder.v
has lex unit: meditation.n
has lex unit: think.v
has lex unit: consideration.n
has lex unit: give thought.null
has lex unit: ponder.v
has lex unit: ruminate.v
has lex unit: consider.v
has lex unit: brood.v
has lex unit: muse.v
has lex unit: contemplate.v
has lex unit: reflection.n
has lex unit: reflect.v
has lex unit: dwell.v
has lex unit: mull over.v
is inherited by: Emotion active
is inherited by: Assessing
is inherited by: Memorization
is used by: Research
is used by: Remembering experience
uses: Mental activity