Change_position_on_a_scale
has frame relation: Remainder
has lex unit: elevation.n
has lex unit: dwindle.v
has frame relation: Proliferating in number
has frame element: Circumstances.change position on a scale
has lex unit: elevated.adj
has frame element: Difference.change position on a scale
has lex unit: explosion.n
has lex unit: drop.v
frame ID: 91
has lex unit: fall.n
has lex unit: tumble.v
subclass of: Restriction
  on property: hasComponent
  some values from: Position on a scale
has lex unit: dip.v
has lex unit: plummet.v
frame c by: JKR
frame sectivity: inter
has frame element: Final state.change position on a scale
has lex unit: mushroom.v
has lex unit: slide.v
is used by: Remainder
has lex unit: fluctuation.n
has lex unit: down.prep
has lex unit: shift.v
has lex unit: reach.v
has lex unit: grow.v
has lex unit: hike.n
has lex unit: increasingly.adv
has lex unit: lower.v
definition: <def-root>This frame consists of words that indicate the change of an <fen>Item</fen>'s position on a scale (the <fen>Attribute</fen>) from a starting point (<fen>Initial_value</fen>) to an end point (<fen>Final_value</fen>). The direction (<fen>Path</fen>) of the movement can be indicated as well as the magnitude of the change (<fen>Difference</fen>). The rate of change of the value (<fen>Speed</fen>) is optionally indicated. Another scale (<fen>Correlate</fen>), which the values are correlated with, is indicated if it is not the default correlate (namely, absolute time). <ex></ex> The distinction between <fen>Attribute</fen>s and <fen>Item</fen>s is not always an easy one. The clear cases involve the expression of the <fen>Attribute</fen> in an <ment>in</ment>-PP. <ex><fex name="Item">Hawke's Bay winery</fex> <t>doubled</t> <fex name="Attribute">in size</fex> <fex name="Time">last year</fex>.</ex> <ex>The amount you can deduct, then, depends on whether or not <fex name="Item">the stock</fex> has <t>increased</t> <fex name="Attribute">in value</fex> <fex name="Time">during the period you have owned it</fex>.</ex> Other clear cases of <fen>Attribute</fen>s involve NP's like <ment>size, quality, number, value</ment> that denote abstract attributes rather than events or classes of things. <ex></ex> The analysis is more complicated when an event-denoting noun phrase occurs as the subject and the sentence has no <ment>in</ment>-PP. In the simplest cases, where the <fen>Attribute</fen> is the number of occurrences of the event, the <fen>Attribute</fen> is usually left implicit, as in exx. 1 and 2, the <fen>Attribute</fen> below. <ex>(1)<fex name="Item">Accidents</fex> <t>increased</t> <fex name="Difference">20%</fex> <fex name="val2">to 345</fex>.</ex> <ex>(1--second FE layer)Accidents <t>increased</t> 20% <fex name="Attribute">to 345</fex>.</ex> <ex>(2) <fex name="Item">Attacks on civilians</fex> <t>decreased</t> <fex name="Time">over the last 4 months</fex> <fex name="…
has frame element: Attribute.change position on a scale
has frame element: Initial state.change position on a scale
has frame element: Degree.change position on a scale
has lex unit: rocket.v
has frame element: Path.change position on a scale
has frame element: Final correlate.change position on a scale
has lex unit: rise.v
type: Class
has lex unit: balloon.v
has frame element: Correlate.change position on a scale
has frame element: Containing event.change position on a scale
has frame element: Group.change position on a scale
type: Frame
inherits from: Event
has lex unit: growth.n
has lex unit: accelerated.adj
has lex unit: diminish.v
has lex unit: triple.v
narrower match: synset-growing-adjective-1
has frame relation: Change of quantity of possession
has lex unit: decrease.n
has lex unit: gain.n
has lex unit: decline.v
has frame element: Result.change position on a scale
has lex unit: shift.n
has frame element: Duration.change position on a scale
has lex unit: fall.v
has frame element: Explanation.change position on a scale
has frame element: Final value.change position on a scale
has lex unit: edge.v
has f ecore set: change position on a scale coreSet1
has lex unit: swell.v
has lex unit: soar.v
has lex unit: skyrocket.v
has frame relation: Position on a scale
has lex unit: double.v
has lex unit: swing.v
has frame element: Speed.change position on a scale
has frame relation: Change of temperature
has frame element: Manner.change position on a scale
frame other feature: phase
has lex unit: fluctuate.v
has lex unit: increase.v
has causative: Cause change of position on a scale
has lex unit: move.v
has lex unit: advance.v
has frame relation: Event
has frame element: Initial correlate.change position on a scale
has frame element: Correlated variable.change position on a scale
has lex unit: jump.v