Cause_to_start
type: Class
type: Frame
comment: A Cause, animate or inanimate, causes a process, the Effect, to begin. The murder of Sergei Kirov set off a chain of events that culminated in the Great Terror of the 1930s. Space email sparked astronaut jealousy. A crime surge in a former coal town prompted a crackdown on illegal immigrants.
subclass of: Restriction
  on property: hasComponent
  some values from: Launch process
subclass of: Restriction
  on property: hasComponent
  some values from: Process start
definition: A Cause, animate or inanimate, causes a process, the Effect, to begin. The murder of Sergei Kirov set off a chain of events that culminated in the Great Terror of the 1930s. Space email sparked astronaut jealousy. A crime surge in a former coal town prompted a crackdown on illegal immigrants.
definition: <def-root>A <fen>Cause</fen>, animate or inanimate, causes a process, the <fen>Effect</fen>, to begin. <ex><fex name="Cause">The murder of Sergei Kirov</fex> <t>set off</t> <fex name="Effect">a chain of events that culminated in the Great Terror of the 1930s</fex>.</ex> <ex><fex name="Cause">Ressam</fex> planned to <t>set</t> <fex name="Effect">a bomb</fex> <t>off</t> at the Los Angeles International Airport.</ex> <ex><fex name="Cause">Space email</fex> <t>sparked</t> <fex name="Effect">astronaut jealousy</fex>.</ex> <ex><fex name="Cause">A crime surge in a former coal town</fex> <t>prompted</t> <fex name="Effect">a crackdown on illegal immigrants</fex></ex>.</def-root>
definition: A Cause, animate or inanimate, causes a process, the Effect, to begin. The murder of Sergei Kirov set off a chain of events that culminated in the Great Terror of the 1930s. Ressam planned to set a bomb off at the Los Angeles International Airport. Space email sparked astronaut jealousy. A crime surge in a former coal town prompted a crackdown on illegal immigrants.
frame ID: 381
frame c by: JKR
frame c date: 2002-07-24T11:36:12+02:00
frame name: Cause_to_start
has frame element: Medium.cause to start
has frame element: Explanation.cause to start
has frame element: Depictive.cause to start
has frame element: Purpose.cause to start
has frame element: Communicative force.cause to start
has frame element: Subevent.cause to start
has frame element: Concessive.cause to start
has frame element: New situation.cause to start
has frame element: Effect.cause to start
has frame element: Event description.cause to start
has frame element: Cause.cause to start
has frame element: Circumstances.cause to start
has frame element: Co-timed event.cause to start
has frame element: Time.cause to start
has frame element: Means.cause to start
has frame element: Place.cause to start
has frame element: Manner.cause to start
has frame element: Epistemic stance.cause to start
has frame element: Containing event.cause to start
has frame element: Consecutive.cause to start
has frame element: Particular iteration.cause to start
has frame relation: Process start
has frame relation: Causation
has frame relation: Launch process
has lex unit: provoke.v
has lex unit: call forth.v
has lex unit: arouse.v
has lex unit: set off.v
has lex unit: engender.v
has lex unit: stir up.v
has lex unit: create.v
has lex unit: motivate.v
has lex unit: elicit.v
has lex unit: kindle.v
has lex unit: incite.v
has lex unit: actuate.v
has lex unit: instigate.v
has lex unit: produce.v
has lex unit: excite.v
has lex unit: trigger.v
has lex unit: prompt.v
has lex unit: spark.v
has lex unit: bring about.v
has lex unit: stimulate.v
has lex unit: generate.v
inherits from: Causation
is causative of: Process start
is used by: Launch process