Cause_change_of_position_on_a_scale
has lex unit: drop.v
has frame element: Attribute.cause change of position on a scale
type: Class
is inherited by: Cause proliferation in number
has frame element: Difference.cause change of position on a scale
has lex unit: cut.v
has lex unit: move.v
frame c date: 2001-04-06T10:57:51+02:00
has frame element: Cause.cause change of position on a scale
has lex unit: double.v
definition: This frame consists of words that indicate that an Agent or a Cause affects the position of an Item on some scale (the Attribute) to change it from an initial value (Value_1) to an end value (Value_2). The direction of the change (Path) can be encoded as well as the magnitude of the change (Difference). The rate of change of the value (Speed) can optionally be indicated as well as a second scale (Co_Variable), which the values are correlated with. The company is raising the final dividend from 4.34p to 4.57p, to boost the total by 5.3 percent to 6.36p. Similarly, a consumer boom will encourage the authorities to increase interest rates in order to keep money supply on target. United Way of Central Indiana adds value to your investment.
has frame element: Co Variable.cause change of position on a scale
has lex unit: raise.v
has lex unit: development.n
type: Frame
subclass of: Transitive action
has frame element: Time.cause change of position on a scale
inherits from: Objective influence
has lex unit: reduce.v
has lex unit: growth.n
definition: This frame consists of words that indicate that an Agent or a Cause affects the position of an Item on some scale (the Attribute) to change it from an initial value (Value_1) to an end value (Value_2). The direction of the change (Path) can be encoded as well as the magnitude of the change (Difference). The rate of change of the value (Speed) can optionally be indicated as well as a second scale (Co_Variable), which the values are correlated with.
has lex unit: lower.v
has frame element: Means.cause change of position on a scale
has lex unit: diminish.v
frame ID: 96
has lex unit: reduction.n
has lex unit: push.v
has frame relation: Transitive action
frame c by: JKR
has frame element: Path.cause change of position on a scale
has frame element: Place.cause change of position on a scale
has frame element: Manner.cause change of position on a scale
has lex unit: push.n
has lex unit: step up.v
inherits from: Event
has lex unit: curtail.v
has frame element: Purpose.cause change of position on a scale
has lex unit: crank.v
has lex unit: slash.v
has frame relation: Change position on a scale
has lex unit: promote.v
has frame element: Co-variable.cause change of position on a scale
inherits from: Transitive action
has frame element: Value 2.cause change of position on a scale
definition: <def-root>This frame consists of words that indicate that an <fen>Agent</fen> or a <fen>Cause</fen> affects the position of an <fen>Item</fen> on some scale (the <fen>Attribute</fen>) to change it from an initial value (<fen>Value_1</fen>) to an end value (<fen>Value_2</fen>). The direction of the change (<fen>Path</fen>) can be encoded as well as the magnitude of the change (<fen>Difference</fen>). The rate of change of the value (<fen>Speed</fen>) can optionally be indicated as well as a second scale (<fen>Co_Variable</fen>), which the values are correlated with. </def-root>
has lex unit: lift.v
has lex unit: increase.v
has lex unit: knock down.v
has lex unit: add.v
has lex unit: swell.v
has frame relation: Cause proliferation in number
has frame element: Item.cause change of position on a scale
comment: This frame consists of words that indicate that an Agent or a Cause affects the position of an Item on some scale (the Attribute) to change it from an initial value (Value_1) to an end value (Value_2). The direction of the change (Path) can be encoded as well as the magnitude of the change (Difference). The rate of change of the value (Speed) can optionally be indicated as well as a second scale (Co_Variable), which the values are correlated with. The company is raising the final dividend from 4.34p to 4.57p, to boost the total by 5.3 percent to 6.36p. Similarly, a consumer boom will encourage the authorities to increase interest rates in order to keep money supply on target. United Way of Central Indiana adds value to your investment.
has frame element: Speed.cause change of position on a scale
has frame element: Value 1.cause change of position on a scale
is causative of: Change position on a scale
frame name: Cause_change_of_position_on_a_scale
subclass of: Restriction
  on property: hasComponent
  some values from: Change position on a scale
has frame element: Agent.cause change of position on a scale
subclass of: Restriction
  on property: hasComponent
  some values from: Cause proliferation in number
has lex unit: enhance.v
has lex unit: cut.n
has lex unit: decrease.v
has f ecore set: cause change of position on a scale coreSet1