Buildings
type: Class
type: Frame
comment: This frame contains words which name permanent fixed structures forming an enclosure and providing protection from the elements. The baroque church, built in 1635, has a very rich interior The city tour includes the 16th-century monastery of the Transfiguration and Church of Elijah the Prophet An ancient stone church stands amid the fields Jack built his house in the style of the day.
subclass of: Artifact
subclass of: Restriction
  on property: hasComponent
  some values from: Building subparts
inherits from: Artifact
inherits from: Entity
definition: This frame contains words which name permanent fixed structures forming an enclosure and providing protection from the elements. The baroque church, built in 1635, has a very rich interior The city tour includes the 16th-century monastery of the Transfiguration and Church of Elijah the Prophet An ancient stone church stands amid the fields Jack built his house in the style of the day.
definition: <def-root>This frame contains words which name permanent fixed structures forming an enclosure and providing protection from the elements. <ex>The <fex name="Type">baroque</fex> <t>church</t>, built in 1635, has a very rich interior</ex> <ex>The city tour includes the <fex name="toc">16th-century</fex> <t>monastery</t> of the Transfiguration and Church of Elijah the Prophet</ex> <ex>An ancient <fex name="Mat">stone</fex> <t>church</t> stands amid the fields</ex> <ex>Jack <gov>built</gov> <x>his <t>house</t></x> in the style of the day.</ex></def-root>
definition: This frame contains words which name permanent fixed structures forming an enclosure and providing protection from the elements. The baroque church, built in 1635, has a very rich interior The city tour includes the 16th-century monastery of the Transfiguration and Church of Elijah the Prophet An ancient stone church stands amid the fields Jack <gov>built</gov> <x>his house</x> in the style of the day.
frame ID: 173
frame c by: HCB
frame c date: 2001-07-12T12:49:21+02:00
frame name: Buildings
has frame element: Building.buildings
has frame element: Place.buildings
has frame element: Creator.buildings
has frame element: Function.buildings
has frame element: Time of creation.buildings
has frame element: Relative location.buildings
has frame element: Name.buildings
has frame element: Descriptor.buildings
has frame element: Possessor.buildings
has frame element: Material.buildings
has frame element: Builder.buildings
has frame element: Type.buildings
has frame relation: Building subparts
has frame relation: Locale by use
has frame relation: Artifact
has lex unit: houseboat.n
has lex unit: condominium.n
has lex unit: library.n
has lex unit: arena.n
has lex unit: caravan.n
has lex unit: tabernacle.n
has lex unit: castle.n
has lex unit: shelter.n
has lex unit: barracks.n
has lex unit: kennel.n
has lex unit: supermarket.n
has lex unit: manse.n
has lex unit: airport.n
has lex unit: bar.n
has lex unit: mansion.n
has lex unit: building.n
has lex unit: caravanserai.n
has lex unit: theater.n
has lex unit: pagoda.n
has lex unit: mall.n
has lex unit: stadium.n
has lex unit: dormitory.n
has lex unit: disco.n
has lex unit: pub.n
has lex unit: monastery.n
has lex unit: dwelling.n
has lex unit: maisonette.n
has lex unit: temple.n
has lex unit: warehouse.n
has lex unit: stable.n
has lex unit: manor.n
has lex unit: motel.n
has lex unit: housing.n
has lex unit: pyramid.n
has lex unit: villa.n
has lex unit: fort.n
has lex unit: conservatory.n
has lex unit: tenement.n
has lex unit: garage.n
has lex unit: hotel.n
has lex unit: palace.n
has lex unit: bungalow.n
has lex unit: palazzo.n
has lex unit: hangar.n
has lex unit: home.n
has lex unit: igloo.n
has lex unit: pension.n
has lex unit: hacienda.n
has lex unit: outbuilding.n
has lex unit: blockhouse.n
has lex unit: shack.n