Building
type: Frame
type: Class
comment: This frame describes assembly or construction actions, where an Agent joins Components together to form a Created_entity, which is profiled, and hence the object of the verb. Jack built a new house out of bricks. We glued the airplanes together.
subclass of: Thing
subclass of: Intentionally create
inherits from: Intentionally create
inherits from: Transitive action
inherits from: Event
inherits from: Intentionally act
inherits from: Creating
inherits from: Objective influence
definition: This frame describes assembly or construction actions, where an Agent joins Components together to form a Created_entity, which is profiled, and hence the object of the verb. Jack built a new house out of bricks. We glued the airplanes together.
definition: <def-root>This frame describes assembly or construction actions, where an <fen>Agent</fen> joins <fen>Components</fen> together to form a <fen>Created_entity</fen>, which is profiled, and hence the object of the verb. <ex><fex name="Agent">Jack</fex> <t>built</t> <fex name="CrEnt">a new house</fex> <fex name="Cmpnt">out of bricks</fex>.</ex> <ex>We <t>glued</t> the airplanes <fex name="Result">together</fex>.</ex></def-root>
frame ID: 259
frame c by: ACW
frame c date: 2002-01-22T21:28:23+01:00
frame name: Building
has f ecore set: building coreSet1
has frame element: Agent.building
has frame element: Descriptor.building
has frame element: Result.building
has frame element: Means.building
has frame element: Instrument.building
has frame element: Period of iterations.building
has frame element: Purpose.building
has frame element: Manner.building
has frame element: Time.building
has frame element: Created entity.building
has frame element: Duration.building
has frame element: Place.building
has frame element: Depictive.building
has frame element: Beneficiary.building
has frame element: Particular iteration.building
has frame element: Components.building
has frame relation: Intentionally create
has lex unit: raise.v
has lex unit: construction (entity).n
has lex unit: put together.v
has lex unit: erect.v
has lex unit: construction.n
has lex unit: fit together.v
has lex unit: assembly.n
has lex unit: weld.v
has lex unit: together put.v
has lex unit: together fit.v
has lex unit: build.v
has lex unit: piece together.v
has lex unit: construction(entity).n
has lex unit: make.v
has lex unit: construct.v
has lex unit: together piece.v
has lex unit: glue.v
has lex unit: fashion.v
has lex unit: assemble.v
has sem type: Artifact
has sem type: Activity