Being_employed
type: Frame
type: Class
comment: An Employee has a Position doing work in a particular Field, or doing work on a particular Task, for which an Employer gives Compensation to the Employee. Undocumented foreigners are working as building contractors for Laing Builders.
subclass of: Restriction
  on property: hasComponent
  some values from: People by vocation
subclass of: Restriction
  on property: follows
  some values from: Get a job
subclass of: Restriction
  on property: hasComponent
  some values from: Quitting
narrower match: synset-unemployed-adjective-1
narrower match: synset-idle-adjectivesatellite-7
narrower match: synset-employed-adjective-1
frame sectivity: sub
definition: An Employee has a Position doing work in a particular Field, or doing work on a particular Task, for which an Employer gives Compensation to the Employee. Undocumented foreigners are working as building contractors for Laing Builders.
definition: <def-root>An <fen>Employee</fen> has a <fen>Position</fen> doing work in a particular <fen>Field</fen>, or doing work on a particular <fen>Task</fen>, for which an <fen>Employer</fen> gives <fen>Compensation</fen> to the <fen>Employee</fen>. <ex> <fex name="Employee">Undocumented foreigners</fex> are <t>working</t> <fex name="Position">as building contractors</fex> <fex name="Employer">for Laing Builders</fex>.</ex></def-root>
frame ID: 282
frame c by: MJE
frame c date: 2002-03-06T11:54:30+01:00
frame name: Being_employed
has f ecore set: being employed coreSet1
has frame element: Rank.being employed
has frame element: Employee.being employed
has frame element: Event description.being employed
has frame element: Circumstances.being employed
has frame element: Duration.being employed
has frame element: Manner.being employed
has frame element: Employer.being employed
has frame element: Field.being employed
has frame element: Task.being employed
has frame element: Position.being employed
has frame element: Particular iteration.being employed
has frame element: Amount of work.being employed
has frame element: Type.being employed
has frame element: Frequency.being employed
has frame element: Place of employment.being employed
has frame element: Time.being employed
has frame element: Contract basis.being employed
has frame element: Compensation.being employed
has frame element: Purpose.being employed
has frame element: Place.being employed
has frame relation: Quitting
has frame relation: Employment continue
has frame relation: Get a job
has frame relation: Employee scenario
has lex unit: jobless.a
has lex unit: wait tables.v
has lex unit: work.n
has lex unit: jobless.adj
has lex unit: at.prep
has lex unit: work.v
has lex unit: employment.n
has lex unit: workplace.n
has lex unit: farm (out).v
has lex unit: employ.n
has lex unit: position.n
has lex unit: farm.v
has lex unit: employed.adj
has lex unit: unemployed.adj
has lex unit: clerk.v
has lex unit: stint.n
has lex unit: temp.v
has lex unit: job.n
has lex unit: employed.a
has lex unit: wait tables.null
has lex unit: unemployed.a
has lex unit: joblessness.n
has lex unit: subcontract.v
has lex unit: unemployment.n
is preceded by: Get a job
perspective on: Employment continue
precedes: Quitting
subframe of: Employees scenario
subframe of: Employee scenario