Assessing
has frame element: Place.assessing
has lex unit: reappraise.v
frame name: Assessing
inherits from: Cogitation
has lex unit: weigh.v
has frame element: Explanation.assessing
type: Frame
has frame element: Beneficiary.assessing
has lex unit: evaluation.n
has frame element: Assessor.assessing
has frame element: Value.assessing
has frame element: Circumstances.assessing
has lex unit: reappraisal.n
subclass of: Cogitation
has frame element: Frequency.assessing
has lex unit: rank.v
frame c by: MJE
has frame element: Phenomenon.assessing
has lex unit: assessment.n
definition: An Assessor examines a Phenomenon to figure out its Value according to some Feature of the Phenomenon. This Value is a factor in determining the acceptability of the Phenomenon. In some cases, a Method (implicitly involving an Assessor) is used to determine the Phenomenon's Value. Each company is then evaluated for their earning potential. CNI From the evidence of the pilot studies the risk of damage to the test subjects was rated too high to continue. CNI He weighed his options carefully.
definition: <def-root>An <fen>Assessor</fen> examines a <fen>Phenomenon</fen> to figure out its <fen>Value</fen> according to some <fen>Feature</fen> of the <fen>Phenomenon</fen>. This <fen>Value</fen> is a factor in determining the acceptability of the <fen>Phenomenon</fen>. In some cases, a <fen>Method</fen> (implicitly involving an <fen>Assessor</fen>) is used to determine the <fen>Phenomenon</fen>'s <fen>Value</fen>. <ex><fex name="Phenomenon">Each company</fex> is then <t>evaluated</t> <fex name="Feature">for their earning potential</fex>. <fex name="Assessor">CNI</fex> </ex> <ex><fex name="Evidence">From the evidence of the pilot studies</fex> <fex name="Phenomenon">the risk of damage to the test subjects</fex> was <t>rated</t> <fex name="Value">too high to continue</fex>. <fex name="Assessor">CNI</fex></ex> <ex><fex name="Assessor">He</fex> <t>weighed</t> <fex name="Phenomenon">his options</fex> <fex name="Manner">carefully</fex>.</ex></def-root>
has frame element: Method.assessing
has frame element: Feature.assessing
has lex unit: grade.v
has f ecore set: assessing coreSet2
has lex unit: rate.v
has frame element: Medium.assessing
has frame relation: Cogitation
type: Class
has f ecore set: assessing coreSet1
has lex unit: appraise.v
has frame element: Degree.assessing
has frame element: Duration.assessing
has frame element: Standard.assessing
has frame element: Time.assessing
has lex unit: appraisal.n
has lex unit: value.v
has frame element: Depictive.assessing
has frame element: Manner.assessing
has frame element: Result.assessing
has frame element: Co participant.assessing
frame c date: 2003-01-21T13:11:55+01:00
has frame element: Purpose.assessing
frame ID: 519
comment: An Assessor examines a Phenomenon to figure out its Value according to some Feature of the Phenomenon. This Value is a factor in determining the acceptability of the Phenomenon. In some cases, a Method (implicitly involving an Assessor) is used to determine the Phenomenon's Value. Each company is then evaluated for their earning potential. CNI From the evidence of the pilot studies the risk of damage to the test subjects was rated too high to continue. CNI He weighed his options carefully.
has lex unit: evaluate.v
has frame element: Evidence.assessing
has lex unit: assess.v
has frame element: Means.assessing
has lex unit: judge.v
has frame element: Co-participant.assessing