Artifact
has frame element: Creator.artifact
is inherited by: Fastener
has subframe: Artifact subpart
has frame element: Material.artifact
frame c date: 2002-11-01T14:21:21+01:00
is inherited by: Key
has frame element: Descriptor.artifact
type: Frame
has frame relation: Accoutrements
is inherited by: Controller object
has frame relation: Being operational
has frame element: Artifact.artifact
has frame relation: Using
subclass of: Restriction
  on property: hasComponent
  some values from: Money
is inherited by: Weapon
has frame relation: Noise makers
has frame relation: Fastener
is inherited by: Money
definition: An Artifact is deliberately made or modified by an intelligent entity to be put to a certain kind of Use. Various properties of the Artifact may be specified, such as its Creator, Time_of_creation, Name, Type, and the Material of which it is composed. The Artifact may or may not be a physical entity. There are reports that Kim Il Sung asked China to share its nuclear weapons technology.
has frame relation: Medical instruments
has lex unit: whisk.n
has frame relation: Body decoration
has lex unit: wheel.n
is inherited by: Accoutrements
has frame relation: Text
has frame relation: Vehicle
has frame relation: Ammunition
has frame relation: Artifact subpart
has frame relation: Fire break
is inherited by: Body decoration
has lex unit: biotechnology.n
is inherited by: Law
is inherited by: Connectors
has frame relation: Buildings
has lex unit: tub.n
is inherited by: Fire break
is inherited by: Infrastructure
has frame element: Time of creation.artifact
has frame relation: Law
has frame relation: Entity
has frame element: Name.artifact
has lex unit: control panel.n
has lex unit: phone.n
is inherited by: Buildings
is inherited by: Medical instruments
has frame relation: Gizmo
has lex unit: board.n
has frame relation: Information display
has frame relation: Connectors
has lex unit: technology.n
is inherited by: Noise makers
uses: Using
has frame relation: Infrastructure
has frame relation: Physical artworks
has lex unit: spatula.n
is used by: Gizmo
has frame relation: Key
is inherited by: Clothing
subclass of: Entity
has frame relation: Controller object
inherits from: Entity
has frame element: Use.artifact
frame ID: 421
has lex unit: oven.n
is used by: Being operational
frame name: Artifact
is inherited by: Ammunition
type: Class
is inherited by: Physical artworks
has frame relation: Money
is inherited by: Information display
has lex unit: artifact.n
is inherited by: Text
comment: An Artifact is deliberately made or modified by an intelligent entity to be put to a certain kind of Use. Various properties of the Artifact may be specified, such as its Creator, Time_of_creation, Name, Type, and the Material of which it is composed. The Artifact may or may not be a physical entity. There are reports that Kim Il Sung asked China to share its nuclear weapons technology.
has lex unit: timer.n
definition: <def-root>An <fen>Artifact</fen> is deliberately made or modified by an intelligent entity to be put to a certain kind of <fen>Use</fen>. Various properties of the <fen>Artifact</fen> may be specified, such as its <fen>Creator</fen>, <fen>Time_of_creation</fen>, <fen>Name</fen>, <fen>Type</fen>, and the <fen>Material</fen> of which it is composed. The <fen>Artifact</fen> may or may not be a physical entity.</def-root>
is inherited by: Vehicle
has frame element: Type.artifact
has frame relation: Clothing
definition: An Artifact is deliberately made or modified by an intelligent entity to be put to a certain kind of Use. Various properties of the Artifact may be specified, such as its Creator, Time_of_creation, Name, Type, and the Material of which it is composed. The Artifact may or may not be a physical entity.