Arriving
has frame relation: Eventive affecting
has frame relation: Departing
has lex unit: arrive.v
has frame element: Mode of transportation.arriving
has frame element: New situation.arriving
frame name: Arriving
has lex unit: make it.v
has frame relation: Visiting scenario arrival
has frame relation: Having or lacking access
is inherited by: Visiting scenario arrival
has frame element: Circumstances.arriving
has frame element: Cotheme.arriving
inherits from: Eventive affecting
has frame element: Goal.arriving
has lex unit: hit.v
type: Frame
has frame element: Event description.arriving
has lex unit: come.v
subframe of: Traversing
has lex unit: descend.v
has lex unit: return.n
is inherited by: Vehicle landing
is preceded by: Departing
comment: An object Theme moves in the direction of a Goal. The Goal may be expressed or it may be understood from context, but its is always implied by the verb itself. Some students arrived at the school on Sunday. It was his arrival at Nijmegen in 837 that made the Vikings withdraw.
has frame element: Depictive.arriving
has frame element: Path.arriving
has lex unit: return.v
has lex unit: get.v
has frame element: Manner.arriving
has lex unit: entry.n
type: Class
definition: An object Theme moves in the direction of a Goal. The Goal may be expressed or it may be understood from context, but its is always implied by the verb itself.
has frame element: Goal conditions.arriving
has lex unit: appear.v
definition: An object Theme moves in the direction of a Goal. The Goal may be expressed or it may be understood from context, but its is always implied by the verb itself. Some students arrived at the school on Sunday. It was his arrival at Nijmegen in 837 that made the Vikings withdraw.
has frame element: Re-encoding.arriving
has frame element: Period of iterations.arriving
subclass of: Restriction
  on property: follows
  some values from: Departing
has lex unit: visit.n
has lex unit: approach.n
has lex unit: visit.v
has frame element: Purpose.arriving
has frame element: Place.arriving
has lex unit: approach.v
frame c by: ChW
has lex unit: crest.v
has lex unit: find.v
frame c date: 2001-02-07T13:12:10+01:00
inherits from: Event
has lex unit: descend (on).v
has lex unit: arrival.n
is used by: Having or lacking access
has frame element: Theme.arriving
frame ID: 54
has lex unit: make.v
subclass of: Restriction
  on property: hasComponent
  some values from: Visitor arrival
has lex unit: influx.n
subclass of: Restriction
  on property: hasComponent
  some values from: Visiting scenario arrival
has frame element: Time.arriving
has frame element: Re encoding.arriving
definition: <def-root>An object <fen>Theme</fen> moves in the direction of a <fen>Goal</fen>. The <fen>Goal</fen> may be expressed or it may be understood from context, but its is always implied by the verb itself.</def-root>
subclass of: Restriction
  on property: hasComponent
  some values from: Having or lacking access
has frame relation: Traversing
has lex unit: entrance.n
has frame element: Means.arriving
has lex unit: reach.v
has lex unit: enter.v
has frame element: Degree.arriving
is inherited by: Visitor arrival
has frame relation: Vehicle landing
has frame element: Source.arriving
has frame element: Frequency.arriving