Aggregate
has frame relation: Entourage
has lex unit: throng.n
has lex unit: cluster.n
has frame relation: Store
has lex unit: covey.n
has lex unit: assortment.n
has lex unit: collection.n
frame c by: JKR
comment: This frame contains nouns denoting Aggregates of Individuals. The Aggregates may be described by an Aggregate_property. An army of postal workers descended on my office.
has lex unit: colony.n
has frame relation: Organization
has lex unit: corps.n
frame c date: 2001-05-09T13:32:40+02:00
has lex unit: harem.n
has lex unit: flotilla.n
has lex unit: gaggle.n
has lex unit: set.n
has lex unit: team.n
definition: This frame contains nouns denoting Aggregates of Individuals. The Aggregates may be described by an Aggregate_property. An army of postal workers descended on my office.
has lex unit: repertoire.n
has lex unit: crowd.n
has lex unit: crop.n
has lex unit: clique.n
has lex unit: combination.n
is inherited by: Entourage
has lex unit: assembly.n
has lex unit: passel.n
has lex unit: herd.n
has lex unit: quartet.n
has frame element: Aggregate property.aggregate
has inchoative: Come together
has lex unit: bevy.n
has frame relation: Come together
has lex unit: slew.n
has lex unit: multitude.n
has frame element: Aggregate.aggregate
type: Class
has lex unit: class.n
is inherited by: Store
has frame relation: Product line
has lex unit: claque.n
has lex unit: mob.n
has lex unit: brood.n
has lex unit: book.n
has lex unit: band.n
has lex unit: community.n
has lex unit: coterie.n
definition: <def-root>This frame contains nouns denoting <fen>Aggregate</fen>s of <fen>Individuals</fen>. The <fen>Aggregate</fen>s may be described by an <fen>AggregateProperty</fen>. <ex>An <t><fex name="Agg">army</fex></t> <fex name="Individuals">of postal workers</fex> descended on my office.</ex> </def-root>
has lex unit: posse.n
subclass of: Restriction
  on property: hasComponent
  some values from: Store
has lex unit: force.n
has lex unit: cohort.n
frame ID: 103
has frame element: AggregateProperty.aggregate
is inherited by: Product line
has frame element: Container possessor.aggregate
has lex unit: shoal.n
type: Frame
has lex unit: school.n
has lex unit: flock.n
has lex unit: gang.n
frame name: Aggregate
is inherited by: Team
has lex unit: quintet.n
has frame relation: Team
has lex unit: pack.n
has lex unit: clutch.n
has lex unit: party.n
has lex unit: heap.n
has lex unit: army.n
has lex unit: tribe.n
has lex unit: body.n
has lex unit: bunch.n
has lex unit: host.n
has lex unit: package.n
has lex unit: trio.n
has frame element: Individuals.aggregate
has lex unit: clump.n
has lex unit: assemblage.n
has lex unit: population.n