Adorning
has lex unit: stud.v
has lex unit: adorn.v
has lex unit: garnish.v
has frame element: Theme.adorning
definition: This frame involves a static (primarily spatial) relationship between a Location and a Theme. All of the verbs used statically in this frame can also occur in the frame Filling, producing pairs such as the following: Filling: Pat covered the table with flowers. Adorning: Flowers covered the table. Please note: <ment>adorned</ment>, <ment>covered</ment>, etc are in the Abounding_with frame because of the point of view shift.
has lex unit: cover.v
inherits from: Trajector-Landmark
has lex unit: cloak.v
has lex unit: festoon.v
has lex unit: film.v
inherits from: Locative relation
has lex unit: coat.v
subclass of: Locative relation
has frame element: Time.adorning
has lex unit: pave.v
inherits from: State
type: Class
has lex unit: decorate.v
has lex unit: wreathe.v
type: Frame
has lex unit: encrust.v
has lex unit: envelop.v
has lex unit: blanket.v
has frame element: Location.adorning
has lex unit: encircle.v
has frame element: Subregion.adorning
has lex unit: line.v
subclass of: Restriction
  on property: hasComponent
  some values from: Abounding with
definition: <def-root>This frame involves a static (primarily spatial) relationship between a <fen>Location</fen> and a <fen>Theme</fen>. All of the verbs used statically in this frame can also occur in the frame Filling, producing pairs such as the following: <ex>Filling: Pat <t>covered</t> the table with flowers.</ex> <ex>Adorning: Flowers <t>covered</t> the table.</ex> Please note: <ment>adorned</ment>, <ment>covered</ment>, etc are in the Abounding_with frame because of the point of view shift. </def-root>
has lex unit: deck.v
has lex unit: fill.v
inherits from: Relation
has lex unit: dot.v
frame name: Adorning