Accoutrements
has lex unit: glasses.n
has lex unit: trinket.n
has lex unit: choker.n
has lex unit: turban.n
has lex unit: toupee.n
has lex unit: headband.n
type: Frame
has lex unit: coif.n
has lex unit: top-hat.n
subclass of: Restriction
  on property: hasComponent
  some values from: Wearing
has frame element: Body location.accoutrements
has frame element: Descriptor.accoutrements
has lex unit: beret.n
has lex unit: bonnet.n
has lex unit: armlet.n
has frame relation: Undressing
has lex unit: sombrero.n
has lex unit: hairpiece.n
has lex unit: anklet.n
has frame element: Accoutrement.accoutrements
has sem type: Artifact
has frame element: Wearer.accoutrements
has lex unit: helm.n
has lex unit: panama.n
has lex unit: hairgrip.n
has lex unit: goggles.n
has lex unit: accoutrement.n
has lex unit: ring.n
has lex unit: hat.n
has lex unit: spectacles.n
definition: A Wearer wears accessories, which are made of some Material and may have a Style. Most of the accessories are non-essential (clothing) items. She wore a black velvet hat on her head.
has lex unit: cap.n
has lex unit: trilby.n
has lex unit: helmet.n
inherits from: Artifact
has lex unit: yarmulkah.n
has lex unit: cufflink.n
has frame relation: Wearing
frame c by: Shw
has lex unit: hairslide.n
definition: <def-root>A <fen>Wearer</fen> wears accessories, which are made of some <fen>Material</fen> and may have a <fen>Style</fen>. Most of the accessories are non-essential (clothing) items. <ex><fex name="Wearer">She</fex> wore <fex name="Descriptor">a black</fex> <fex name="Material">velvet</fex> <t>hat</t> <fex name="Body_location">on her head</fex>.</ex></def-root>
has lex unit: jewelry.n
has lex unit: sporran.n
has frame relation: Dressing
has lex unit: bandanna.n
has lex unit: jewellery.n
has lex unit: sash.n
has lex unit: ribbon.n
has lex unit: nightcap.n
has lex unit: hairband.n
has lex unit: hat-pin.n
has lex unit: mitre.n
has lex unit: necklace.n
has frame element: Time of creation.accoutrements
has lex unit: armband.n
comment: A Wearer wears accessories, which are made of some Material and may have a Style. Most of the accessories are non-essential (clothing) items. She wore a black velvet hat on her head.
has lex unit: hairnet.n
has lex unit: chain.n
frame c date: 2001-07-03T16:31:37+02:00
is used by: Dressing
has lex unit: badge.n
has lex unit: mask.n
has lex unit: boater.n
has lex unit: pendant.n
has frame element: Part.accoutrements
has lex unit: gorget.n
has lex unit: medal.n
has lex unit: coronet.n
has lex unit: regalia.n
has lex unit: snood.n
has lex unit: fez.n
frame ID: 158
is used by: Undressing
type: Class
has lex unit: veil.n
has lex unit: locket.n
has lex unit: tiara.n
has lex unit: biretta.n
has lex unit: diadem.n